{"text_format":"1","workbook":"xlsx","n_sheets":16,"sheets":["Main Form","Dropdowns","Anticipated Conflicts","A-3","A-5A","A-5D","A-5P","A-5R","A-5T","A-6E","A-6N","A-7PR","A-7PT","A-8","A-9","A-10"],"not_rendered":{"charts":0,"images":10,"macros":1,"external_links":0,"defined_names":42,"comments":0,"pivot_tables":0},"unopened":[],"bounds":{"document_bytes":16777216,"sheet_cells":100000,"rows_first":2000,"rows_last":500,"rows_between":2000,"halvings":0,"cell_chars":16384,"cell_head_chars":4096},"cells_cut":0,"cells_raw":0,"read":"whole","date_system":"1900"}

{"sheet":"Main Form","index":0,"n_rows":464,"n_cols":36,"rows_kept":464,"cut":false,"hidden":false,"merged":[[203,15,203,17],[204,15,204,17],[205,15,205,17],[154,8,155,12],[154,13,155,13],[154,14,155,19],[195,7,195,34],[196,7,196,34],[197,7,197,34],[198,7,198,34],[201,1,201,34],[158,8,158,13],[159,8,159,13],[160,8,160,13],[161,8,161,13],[194,7,194,34],[160,16,160,21],[159,24,159,29],[160,24,160,29],[195,2,195,6],[196,2,196,6],[197,2,197,6],[162,16,162,21],[161,16,161,21],[10,26,10,34],[10,4,10,20],[12,9,12,15],[13,9,13,15],[14,9,14,15],[1,28,1,34],[9,26,9,34],[8,26,8,34],[7,26,7,34],[7,4,7,20],[8,4,8,20],[9,4,9,20],[4,1,4,14],[4,15,4,34],[5,1,5,14],[5,15,5,34],[3,29,3,34],[3,1,3,7],[1,4,1,23],[120,2,121,34],[123,2,124,34],[126,2,127,34],[64,2,64,31],[66,2,66,34],[12,16,12,20],[13,16,13,20],[14,16,14,20],[15,16,15,20],[19,2,19,34],[26,2,26,34],[40,2,40,34],[45,2,45,34],[55,2,55,34],[52,2,53,34],[23,2,24,34],[33,3,34,34],[36,3,37,34],[42,2,43,34],[50,4,50,34],[71,2,71,10],[117,2,118,34],[72,2,72,34],[81,2,81,34],[86,2,86,34],[92,2,92,34],[71,11,71,16],[71,17,71,24],[102,2,103,34],[105,2,106,34],[108,2,109,34],[111,2,112,34],[114,2,115,34],[97,2,97,34],[99,2,100,34],[144,7,144,34],[145,7,145,34],[146,7,146,34],[147,7,147,34],[158,24,158,29],[159,16,159,21],[69,2,69,34],[405,6,405,12],[419,6,419,12],[207,6,207,12],[162,8,162,13],[158,16,158,21],[198,2,198,6],[144,2,144,6],[145,2,145,6],[146,2,146,6],[147,2,147,6],[194,2,194,6],[136,2,136,34],[142,2,142,34],[149,2,149,34],[154,7,155,7],[129,2,130,34],[132,2,133,34],[442,6,442,12],[448,6,448,12],[456,6,456,12],[280,6,280,12],[307,6,307,12],[343,6,343,12],[371,6,371,12],[382,6,382,12],[223,6,223,12],[225,6,225,12],[230,6,230,12],[252,6,252,12]]}
[]
[null,null,null,null,"UTILITY WORKSHEET \nWisconsin Department of Transportation",null,null,null,null,null,null,null,null,null,null,null,null,null,null,null,null,null,null,null,null,null,null,null,{"$f":"IF(OR(F208=-1, F224=-1, F226=-1, F231=-1, F253=-1, F281=-1, F308=-1, F344=-1, F372=-1, F383=-1, F406=-1, F420=-1, F443=-1, F449=-1, F457=-1), \"INCOMPLETE\", \"\")","v":"INCOMPLETE"}]
[null,"DT2236        03/2026        §84.063 Wis. Stats."]
[null,"Locals    03/2026     \nv2.0",null,null,null,null,null,null,null,null,null,null,null,null,null,null,null,null,null,null,null,null,null,null,null,null,null,null,null,"Job Aid (See §2.2)"]
[null,"UTILITY FACILITY OWNER (OWNER):"]
[null,"UTILITY FACILITY TYPE:"]
{"$rows_left_out":459}
{"sheet":"Dropdowns","index":1,"n_rows":2,"n_cols":39,"rows_kept":2,"cut":false,"hidden":true,"merged":[]}
[null,"ALG",null,null,null,"PRS",null,"UTE",null,null,null,null,"UTT",null,null,null,"CRW",null,"FCO",null,"FMA",null,"HCW",null,"LIR",null,"ITM",null,"PMT",null,"PRO",null,"UWP",null,"RFA",null,"EPA",null,"RBY"]
[null,"ALIGNMENT","MIN STA","MAX STA",null,"PROJECT STAGE",null,"UTILITY NAME","UTILITY FACILITY TYPE","UTILITY ENTITIES","UTILITY ABBR",null,"UTILITY FACILITY TYPE","TUMS ABBR","PLAN ABBR",null,"CONFLICT / REASON FOR WORK",null,"FACILITY COMPONENT",null,"FACILITY MATERIAL",null,"HIGHWAY CONTRACT WORK COMPLETED",null,"LAND INTEREST REQUIRED",null,"ITEM",null,"PERMIT",null,"PROTECTION TYPE",null,"UTILITY WORK PERFORMED",null,"REASON FOR ACQUISITION",null,"TEMPORARY EASEMENTS, PERMISSIONS, ACCESS",null,"REMOVAL BY"]

{"sheet":"Anticipated Conflicts","index":2,"n_rows":20,"n_cols":19,"rows_kept":20,"cut":false,"hidden":false,"merged":[[19,1,19,18],[11,2,11,4],[11,5,11,7],[12,2,13,2],[12,3,12,4],[12,5,13,5],[12,6,12,7],[11,8,13,8],[11,10,13,10],[11,11,13,11],[11,9,13,9],[12,14,13,14],[1,1,1,18],[8,2,8,18],[11,1,13,1],[11,12,13,12],[11,14,11,18],[4,2,4,18],[7,2,7,18],[5,2,5,18],[6,2,6,18],[12,15,13,15],[12,16,13,16],[12,17,13,17],[12,18,13,18],[11,13,13,13],[3,1,3,18]]}
[]
[null,"\nANTICIPATED CONFLICTS"]
[null,{"$f":"IF('Main Form'!$P$5 = \"\",\"\",'Main Form'!$P$5 & \" - \" &'Main Form'!$P$6)","v":""}]
[null,"Evaluate each potential utility conflict. This list is not exhaustive and is provided as a benefit to the Utility Facility Owner (OWNER) on behalf of the utility coordinator and project team. Data contained within this table must be imported into the required attachments.\n\nSelect the appropriate response for the CONFLICT ANTICIPATED OR NEW INSTALL column:\n      •  YES → It has been determined that the utility facility is in conflict, select which attachment(s) is appropriate to resolve the utility conflict.\n      •  YES-COMBINED → It has been determined that the utility facility is in conflict, but the resolution is included in another row. This utility conflict will not be imported into any attachments for question 5.\n      •  NO → It has been determined that the utility facility is not in conflict.\n      •  NO-DISCONTINUE → It has been determined that the utility facility is not in conflict, but will be discontinued. The utility conflict will be imported into Attachment 5D.\n      •  NEW INSTALL → For a new installation. Only select this for a new row that has been added to the table. 5R is automatically checked. Fill in all blank columns as proposed information.\n\nIf there are additional utility conflicts that were not identified in the table, use the Add Blank Row In Table button and fill in the required information.\nWhen complete, check the box that is below the table.\n\nJob Aid (See §2.4 & Appendix B Flowcharts)\n\nNOTE: The following is provided to aid in completing the table below:"]
[null,"5A","Adjustment to Finished Grade Required - Utility facilities will require adjustment to match the finished grade of the project plan. Details are provided on Attachment 5A."]
[null,"5D","Discontinuing in Place and/or Removal of Existing Utility Facilities Required - Existing utility facilities will be discontinued in place and/or removed as a part of the work plan. Details are provided on Attachment 5D."]
{"$rows_left_out":15}
{"sheet":"A-3","index":3,"n_rows":76,"n_cols":3,"rows_kept":76,"cut":false,"hidden":true,"merged":[[12,2,12,11],[45,2,45,11],[49,2,50,11],[54,2,55,11],[57,2,57,11],[18,3,19,11],[21,3,22,11],[39,2,40,11],[24,3,25,11],[31,2,31,11],[42,2,43,11],[4,1,4,11],[5,1,5,11],[6,2,6,11],[7,2,7,11],[8,2,8,11],[62,2,63,11],[65,2,65,11],[67,2,68,11],[75,1,75,11],[71,2,72,11]]}
[]
[null,"EXISTING KNOWN DISCONTINUED UTILITY FACILITIES"]
[null,"Attachment 3"]
[null,{"$f":"IF('Main Form'!$P$5 = \"\",\"\",'Main Form'!$P$5 & \" - \" &'Main Form'!$P$6)","v":""}]
[null,"Any portion(s) of the Utility Facility Owner's (OWNER) existing known discontinued utility facilities that may or will conflict with the project plan must be removed. Portion(s) of existing known discontinued utility facilities to remain must be properly discontinued by plugging and/or bulkheading pipe or conduit ends, and/or filling the utility facility with flowable fill or sand."]
[null,"Note that conflicting portions of existing known discontinued utility facilities must be removed to the following depths:"]
{"$rows_left_out":71}
{"sheet":"A-5A","index":4,"n_rows":76,"n_cols":18,"rows_kept":76,"cut":false,"hidden":true,"merged":[[5,1,5,12],[47,2,48,18],[58,2,59,18],[10,1,10,13],[75,1,75,17],[14,1,16,1],[14,8,16,8],[14,13,14,15],[14,16,16,16],[14,17,16,17],[14,10,16,10],[14,11,16,11],[15,14,15,15],[14,9,16,9],[14,12,16,12],[14,2,14,4],[14,5,14,7],[15,2,16,2],[15,3,15,4],[15,5,16,5],[15,6,15,7]]}
[]
[null,"ADJUSTMENT TO FINISHED GRADE REQUIRED"]
[null,"Attachment 5A"]
[null,{"$f":"IF('Main Form'!$P$5 = \"\",\"\",'Main Form'!$P$5 & \" - \" &'Main Form'!$P$6)","v":""}]
[null,"Adjustment of utility facilities are required to match the finished grade of the project plan."]
[null,"• Fill in the following table for utility facilities to be adjusted."]
{"$rows_left_out":71}
{"sheet":"A-5D","index":5,"n_rows":105,"n_cols":23,"rows_kept":105,"cut":false,"hidden":true,"merged":[[51,1,51,17],[56,1,56,17],[65,1,65,17],[19,21,21,21],[19,15,19,17],[19,5,19,7],[19,1,21,1],[20,6,20,7],[20,5,21,5],[19,9,21,9],[19,12,21,12],[42,2,43,15],[47,2,48,15],[38,1,38,17],[4,1,4,13],[14,1,14,13],[30,2,31,15],[35,2,36,15],[6,1,6,13],[26,1,26,17],[76,2,77,15],[87,2,88,15],[104,1,104,22],[19,2,19,4],[20,2,21,2],[20,3,20,4],[19,10,21,10],[19,11,21,11],[19,8,21,8],[20,16,20,17],[19,18,21,18],[19,19,21,19],[19,20,21,20],[19,22,21,22],[19,13,21,13],[19,14,21,14]]}
[]
[null,"DISCONTINUING IN PLACE AND/OR REMOVING OF EXISTING UTILITY FACILITIES REQUIRED"]
[null,"Attachment 5D"]
[null,{"$f":"IF('Main Form'!$P$5 = \"\",\"\",'Main Form'!$P$5 & \" - \" &'Main Form'!$P$6)","v":""}]
[null,"The Utility Facility Owner's (OWNER) has existing utility facilities to be discontinued in place and/or removed due to conflicts with the project plan. Properly discontinue any existing utility facilities, including services, that will remain by plugging and/or bulkheading pipe or conduit ends, and/or filling the facility with flowable fill or sand."]
[null,"• Fill in the following table for existing utility facilities to be discontinued and/or removed, including the COORDINATION OF A SHARED UTILITY SPACE column."]
{"$rows_left_out":100}
{"sheet":"A-5P","index":6,"n_rows":75,"n_cols":22,"rows_kept":75,"cut":false,"hidden":true,"merged":[[14,18,16,18],[14,19,16,19],[6,1,6,13],[14,16,16,16],[14,17,16,17],[14,14,14,15],[15,14,16,14],[14,9,16,9],[14,5,14,7],[10,1,10,12],[15,5,16,5],[14,21,16,21],[74,1,74,21],[15,6,15,7],[14,10,16,10],[14,11,16,11],[14,12,16,12],[14,13,16,13],[15,15,16,15],[14,1,16,1],[14,2,14,4],[15,2,16,2],[14,8,16,8],[15,3,15,4],[46,2,47,15],[57,2,58,15],[14,20,16,20]]}
[]
[null,"PROTECTION OF EXISTING UTILITY FACILITIES REQUIRED"]
[null,"Attachment 5P"]
[null,{"$f":"IF('Main Form'!$P$5 = \"\",\"\",'Main Form'!$P$5 & \" - \" &'Main Form'!$P$6)","v":""}]
[null,"The Utility Facility Owner's (OWNER) has utility facilities that require protection as conflicts exist with the project plan. "]
[null,"• Fill in the following table for the protection of utility facilities, including the COORDINATION OF A SHARED UTILITY SPACE column."]
{"$rows_left_out":70}
{"sheet":"A-5R","index":7,"n_rows":75,"n_cols":33,"rows_kept":75,"cut":false,"hidden":true,"merged":[[5,1,5,22],[8,1,8,21],[13,16,14,17],[15,16,16,16],[15,17,16,17],[15,9,15,10],[14,2,14,4],[14,5,14,7],[15,3,15,4],[15,5,16,5],[15,2,16,2],[15,6,15,7],[46,2,47,15],[57,2,58,15],[14,11,14,13],[15,11,16,11],[13,14,14,15],[15,14,16,14],[15,15,16,15],[74,1,74,32],[13,2,13,7],[13,8,13,13],[15,8,16,8],[15,12,15,13],[13,32,16,32],[13,30,16,30],[13,1,16,1],[14,8,14,10],[13,29,16,29],[13,28,16,28],[13,25,13,27],[13,22,16,22],[13,23,16,23],[13,24,16,24],[14,26,14,27],[13,31,16,31],[15,25,16,25],[15,27,16,27],[15,26,16,26],[13,18,14,19],[15,18,16,18],[15,19,16,19],[15,20,16,20],[15,21,16,21],[13,20,14,21]]}
[]
[null,"RELOCATION, RECONSTRUCTION, REARRANGEMENT AND/OR NEW UTILITY FACILITY INSTALLATION REQUIRED"]
[null,"Attachment 5R"]
[null,{"$f":"IF('Main Form'!$P$5 = \"\",\"\",'Main Form'!$P$5 & \" - \" &'Main Form'!$P$6)","v":""}]
[null,"The Utility Facility Owner's (OWNER) has utility facilities to be relocated, reconstructed, rearranged, and/or the installation of new utility facilities."]
[null,"• Fill in the following table for the relocation, reconstruction, rearrangement, and/or the installation of new utility facilities, including the COORDINATION OF A SHARED UTILITY SPACE column.\n• All utility facilities to be relocated, reconstructed, rearranged, and/or the installation of new utility facilities must be identified in the Anticipated Conflicts table, and will be imported over via the button below.\n• Show the relocation, reconstruction, rearrangement, and/or the installation of new utility facilities on the marked up copy of the project plan or other approved format."]
{"$rows_left_out":70}
{"sheet":"A-5T","index":8,"n_rows":83,"n_cols":24,"rows_kept":83,"cut":false,"hidden":true,"merged":[[5,1,5,14],[54,2,55,15],[65,2,66,15],[25,1,26,12],[13,13,15,13],[9,1,9,12],[82,1,82,23],[13,23,15,23],[13,12,15,12],[13,14,15,14],[13,15,15,15],[13,2,13,4],[14,2,15,2],[13,1,15,1],[14,3,14,4],[13,5,13,7],[13,16,13,18],[13,19,15,19],[13,20,15,20],[13,21,15,21],[13,22,15,22],[14,5,15,5],[14,17,14,18],[14,6,14,7],[13,10,15,10],[13,11,15,11],[13,8,15,8],[13,9,15,9]]}
[]
[null,"TEMPORARY UTILITY FACILITIES REQUIRED"]
[null,"Attachment 5T"]
[null,{"$f":"IF('Main Form'!$P$5 = \"\",\"\",'Main Form'!$P$5 & \" - \" &'Main Form'!$P$6)","v":""}]
[null,"The Utility Facility Owner (OWNER) has installation and/or removal of temporary facilities, including temporary services."]
[null,"• Fill in the following table for the installation and/or removal of temporary utility facilities, including the COORDINATION OF A SHARED UTILITY SPACE column.\n• All temporary utility facilities to be installed and/or removed must be identified in the Anticipated Conflicts table, and will be imported over via the button below."]
{"$rows_left_out":78}
{"sheet":"A-6E","index":9,"n_rows":132,"n_cols":3,"rows_kept":132,"cut":false,"hidden":true,"merged":[[62,2,63,12],[103,2,103,12],[131,1,131,12],[111,3,112,12],[122,3,123,12],[100,2,100,12],[83,2,83,12],[91,2,91,12],[71,2,72,12],[80,2,81,12],[86,2,87,12],[4,1,4,12],[27,2,27,12],[14,2,14,12],[66,2,66,12],[74,2,74,12],[24,2,25,12],[35,2,36,12],[39,2,40,12],[43,2,44,12],[32,2,32,12],[7,2,7,12],[11,2,12,12],[46,2,46,12],[49,2,49,12],[50,2,51,12],[54,2,54,12]]}
[]
[null,"EXISTING SERVICE WORK REQUIRED"]
[null,"Attachment 6E"]
[null,{"$f":"IF('Main Form'!$P$5 = \"\",\"\",'Main Form'!$P$5 & \" - \" &'Main Form'!$P$6)","v":""}]
[null,"The Utility Facility Owner (OWNER) has removals, discontinuances, modifications, and/or relocations of existing services. \n     • Answer the displayed questions below for the existing service work required."]
[null,"Job Aid (See §2.10)"]
{"$rows_left_out":127}
{"sheet":"A-6N","index":10,"n_rows":99,"n_cols":20,"rows_kept":99,"cut":false,"hidden":true,"merged":[[12,18,15,18],[4,1,4,19],[12,1,15,1],[14,2,15,2],[14,5,15,5],[12,8,15,8],[12,10,15,10],[12,11,15,11],[12,15,15,15],[12,16,15,16],[12,12,12,14],[12,17,15,17],[12,19,15,19],[14,3,14,4],[14,6,14,7],[12,9,15,9],[98,1,98,19],[29,2,30,12],[37,2,38,12],[41,2,42,12],[45,2,46,12],[49,2,50,12],[70,2,70,11],[78,3,79,12],[89,3,90,12],[12,2,12,7],[13,13,13,14],[14,12,15,12],[14,13,15,13],[14,14,15,14],[13,2,13,4],[13,5,13,7]]}
[]
[null,"NEW SERVICE WORK REQUIRED"]
[null,"Attachment 6N"]
[null,{"$f":"IF('Main Form'!$P$5 = \"\",\"\",'Main Form'!$P$5 & \" - \" &'Main Form'!$P$6)","v":""}]
[null,"The Utility Facility Owner (OWNER) needs to coordinate the installation of a new service(s). Include any service-related utility facilities that have not been previously addressed and are impacted by the project plan."]
[null,"• Fill in the following table and answer the questions below for the new service work required."]
{"$rows_left_out":94}
{"sheet":"A-7PR","index":11,"n_rows":23,"n_cols":240,"rows_kept":23,"cut":false,"hidden":true,"merged":[[13,239,16,239],[15,15,16,15],[15,16,15,17],[15,18,16,18],[15,19,15,20],[13,21,14,22],[13,23,14,24],[13,25,14,26],[13,27,14,28],[15,21,16,21],[15,26,16,26],[15,27,16,27],[15,28,16,28],[13,230,16,230],[13,231,16,231],[13,232,16,232],[13,233,16,233],[13,234,16,234],[13,235,16,235],[13,236,16,236],[13,237,16,237],[13,238,16,238],[13,221,16,221],[13,222,16,222],[13,223,16,223],[13,224,16,224],[13,225,16,225],[13,226,16,226],[13,227,16,227],[13,228,16,228],[13,229,16,229],[13,212,16,212],[13,213,16,213],[13,214,16,214],[13,215,16,215],[13,216,16,216],[13,217,16,217],[13,218,16,218],[13,219,16,219],[13,220,16,220],[13,203,16,203],[13,204,16,204],[13,205,16,205],[13,206,16,206],[13,207,16,207],[13,208,16,208],[13,209,16,209],[13,210,16,210],[13,211,16,211],[13,194,16,194],[13,195,16,195],[13,196,16,196],[13,197,16,197],[13,198,16,198],[13,199,16,199],[13,200,16,200],[13,201,16,201],[13,202,16,202],[13,185,16,185],[13,186,16,186],[13,187,16,187],[13,188,16,188],[13,189,16,189],[13,190,16,190],[13,191,16,191],[13,192,16,192],[13,193,16,193],[13,176,16,176],[13,177,16,177],[13,178,16,178],[13,179,16,179],[13,180,16,180],[13,181,16,181],[13,182,16,182],[13,183,16,183],[13,184,16,184],[13,167,16,167],[13,168,16,168],[13,169,16,169],[13,170,16,170],[13,171,16,171],[13,172,16,172],[13,173,16,173],[13,174,16,174],[13,175,16,175],[13,158,16,158],[13,159,16,159],[13,160,16,160],[13,161,16,161],[13,162,16,162],[13,163,16,163],[13,164,16,164],[13,165,16,165],[13,166,16,166],[13,149,16,149],[13,150,16,150],[13,151,16,151],[13,152,16,152],[13,153,16,153],[13,154,16,154],[13,155,16,155],[13,156,16,156],[13,157,16,157],[13,140,16,140],[13,141,16,141],[13,142,16,142],[13,143,16,143],[13,144,16,144],[13,145,16,145],[13,146,16,146],[13,147,16,147],[13,148,16,148],[13,131,16,131],[13,132,16,132],[13,133,16,133],[13,134,16,134],[13,135,16,135],[13,136,16,136],[13,137,16,137],[13,138,16,138],[13,139,16,139],[13,122,16,122],[13,123,16,123],[13,124,16,124],[13,125,16,125],[13,126,16,126],[13,127,16,127],[13,128,16,128],[13,129,16,129],[13,130,16,130],[13,113,16,113],[13,114,16,114],[13,115,16,115],[13,116,16,116],[13,117,16,117],[13,118,16,118],[13,119,16,119],[13,120,16,120],[13,121,16,121],[13,104,16,104],[13,105,16,105],[13,106,16,106],[13,107,16,107],[13,108,16,108],[13,109,16,109],[13,110,16,110],[13,111,16,111],[13,112,16,112],[13,95,16,95],[13,96,16,96],[13,97,16,97],[13,98,16,98],[13,99,16,99],[13,100,16,100],[13,101,16,101],[13,102,16,102],[13,103,16,103],[13,86,16,86],[13,87,16,87],[13,88,16,88],[13,89,16,89],[13,90,16,90],[13,91,16,91],[13,92,16,92],[13,93,16,93],[13,94,16,94],[13,77,16,77],[13,78,16,78],[13,79,16,79],[13,80,16,80],[13,81,16,81],[13,82,16,82],[13,83,16,83],[13,84,16,84],[13,85,16,85],[13,68,16,68],[13,69,16,69],[13,70,16,70],[13,71,16,71],[13,72,16,72],[13,73,16,73],[13,74,16,74],[13,75,16,75],[13,76,16,76],[13,59,16,59],[13,60,16,60],[13,61,16,61],[13,62,16,62],[13,63,16,63],[13,64,16,64],[13,65,16,65],[13,66,16,66],[13,67,16,67],[13,50,16,50],[13,51,16,51],[13,52,16,52],[13,53,16,53],[13,54,16,54],[13,55,16,55],[13,56,16,56],[13,57,16,57],[13,58,16,58],[13,41,16,41],[13,42,16,42],[13,43,16,43],[13,44,16,44],[13,45,16,45],[13,46,16,46],[13,47,16,47],[13,48,16,48],[13,49,16,49],[13,6,16,6],[13,7,16,7],[13,9,13,14],[14,9,14,11],[15,22,16,22],[15,23,16,23],[15,24,16,24],[15,25,16,25],[13,40,16,40],[14,12,14,14],[15,9,16,9],[15,10,15,11],[15,12,16,12],[15,13,15,14],[4,1,4,31],[22,1,22,38],[13,1,16,1],[13,2,16,2],[13,3,16,3],[13,8,16,8],[13,29,13,31],[13,32,16,32],[13,33,16,33],[13,34,16,34],[13,35,16,35],[13,36,16,36],[13,37,16,37],[13,38,16,38],[5,1,5,25],[14,15,14,17],[14,18,14,20],[13,15,13,20],[14,30,14,31],[15,29,16,29],[15,30,16,30],[15,31,16,31],[13,4,16,4],[13,5,16,5]]}
[]
[null,"PROVIDER COORDINATION IN SHARED UTILITY SPACE"]
[null,"Attachment 7PR"]
[null,{"$f":"IF('Main Form'!$P$5 = \"\",\"\",'Main Form'!$P$5 & \" - \" &'Main Form'!$P$6)","v":""}]
[null,"The Utility Facility Owner's (OWNER) proposed utility work is dependent on or affected by the utility work of another utility owner(s) in a shared utility space. Dependent means that the shared utility space is occupied by, or the location is shared with utility facilities of another utility owner(s). Provide details of coordination with other utility owner(s) below and/or on attached sheets. In the CONTACT INFO column, include the contact information of the person/people that were coordinated with at the other utility owner(s). In the NARRATIVE column, include a brief description of the utility work by the other utility owner(s) and how it impacts the OWNER and the OWNER's schedule."]
[null,"• Import utility facilities from the attachment(s) for Question 5.\n• Fill in the rest of the table as the provider in the shared utility space."]
{"$rows_left_out":18}
{"sheet":"A-7PT","index":12,"n_rows":19,"n_cols":23,"rows_kept":19,"cut":false,"hidden":true,"merged":[[18,1,18,22],[11,22,13,22],[12,4,13,4],[12,5,12,6],[12,7,13,7],[12,8,12,9],[12,16,12,17],[11,11,13,11],[11,2,13,2],[4,1,4,22],[11,1,13,1],[11,3,13,3],[11,4,11,6],[11,7,11,9],[11,12,13,12],[11,13,13,13],[11,14,13,14],[11,15,11,17],[11,18,13,18],[11,10,13,10],[11,21,13,21],[11,19,13,19],[11,20,13,20],[5,1,5,12]]}
[]
[null,"PARTICIPANT JOINT USE COORDINATION"]
[null,"Attachment 7PT"]
[null,{"$f":"IF('Main Form'!$P$5 = \"\",\"\",'Main Form'!$P$5 & \" - \" &'Main Form'!$P$6)","v":""}]
[null,"The Utility Facility Owner's (OWNER) proposed utility work is dependent on or affected by the utility work of another utility owner(s) in a shared utility space. Dependent means that the shared utility space is occupied by, or the location is shared with utility facilities of another utility owner(s). Provide details of coordination with other utility owner(s) below and/or on attached sheets. In the CONTACT INFO column, include the contact information of the person/people that were coordinated with at the other utility owner(s). In the NARRATIVE column, include a brief description of the utility work by the other utility owner(s) and how it impacts the OWNER and the OWNER's schedule."]
[null,"• Import utility facilities from the attachment(s) for Question 5.\n• Fill in the rest of the table as the participant in the shared utility space."]
{"$rows_left_out":14}
{"sheet":"A-8","index":13,"n_rows":24,"n_cols":7,"rows_kept":24,"cut":false,"hidden":true,"merged":[[23,1,23,6],[4,1,4,6],[15,1,15,6],[17,1,18,1],[17,2,18,2],[17,3,17,5],[17,6,18,6],[7,1,7,6],[6,1,6,6],[12,1,12,6],[13,1,13,6]]}
[]
[null,"APPROVALS REQUIRED AND SCHEDULE TO OBTAIN APPROVALS"]
[null,"Attachment 8"]
[null,{"$f":"IF('Main Form'!$P$5 = \"\",\"\",'Main Form'!$P$5 & \" - \" &'Main Form'!$P$6)","v":""}]
[null,"Work plan approval and/or start work notice will be issued at least 30 calendar days prior to the Utility Facility Owner's (OWNER) anticipated start date. Identify and select all other approvals required for the OWNER's utility work and provide information about the schedule to obtain those approvals."]
[null,"• Fill in the following table of permits."]
{"$rows_left_out":19}
{"sheet":"A-9","index":14,"n_rows":39,"n_cols":9,"rows_kept":39,"cut":false,"hidden":true,"merged":[[38,1,38,8],[30,1,33,1],[30,2,33,2],[30,3,33,3],[4,1,5,8],[30,8,33,8],[30,4,30,7],[31,4,33,4],[32,6,32,7],[31,5,31,7]]}
[]
[null,"REAL ESTATE PARCELS REQUIRED"]
[null,"Attachment 9"]
[null,{"$f":"IF('Main Form'!$P$5 = \"\",\"\",'Main Form'!$P$5 & \" - \" &'Main Form'!$P$6)","v":""}]
[null,"Real estate parcels need to be acquired to enable the performance of the Utility Facility Owner's (OWNER) utility work. Provide details about the parcels listed below and/or on attached sheets.\nThe following items are required, whether performed by the OWNER or by others, to enable the utility work prior to or during highway construction:"]
[]
{"$rows_left_out":34}
{"sheet":"A-10","index":15,"n_rows":18,"n_cols":13,"rows_kept":18,"cut":false,"hidden":true,"merged":[[10,2,12,2],[11,3,12,3],[10,8,12,8],[4,1,4,12],[17,1,17,12],[9,12,12,12],[9,1,12,1],[9,10,12,10],[9,11,12,11],[9,9,12,9],[11,4,11,5],[11,6,11,7],[10,3,10,7],[9,2,9,8]]}
[]
[null,"EASEMENTS, FEE TITLE, AND/OR LONG-TERM LEASES"]
[null,"Attachment 10"]
[null,{"$f":"IF('Main Form'!$P$5 = \"\",\"\",'Main Form'!$P$5 & \" - \" &'Main Form'!$P$6)","v":""}]
[null,"Identify the easements, fee title, and/or long-term leases the Utility Facility Owner (OWNER) needs to obtain to complete the utility work. Describe the location where the land interests and/or rights are needed, using reference to plat parcel numbers, project stationing, or addresses."]
[null,"• Fill in the following table of easements, fee title, and/or long-term leases to the extent known at time of worksheet submittal."]
{"$rows_left_out":12}