{"text_format":"1","workbook":"xlsx","n_sheets":8,"sheets":["READ ME - Instructions","Mix Design Data Entry","One-Point Verification","3.0% Va Regression","Convert to .txt File","Text Template","Agg_Properties","INTERNAL_SYS_VAR"],"not_rendered":{"charts":2,"images":2,"macros":1,"external_links":0,"defined_names":8,"comments":0,"pivot_tables":0},"unopened":[],"bounds":{"document_bytes":16777216,"sheet_cells":100000,"rows_first":2000,"rows_last":500,"rows_between":2000,"halvings":0,"cell_chars":16384,"cell_head_chars":4096},"cells_cut":0,"cells_raw":0,"read":"whole","date_system":"1900"}

{"sheet":"READ ME - Instructions","index":0,"n_rows":3,"n_cols":4,"rows_kept":3,"cut":false,"hidden":false,"merged":[[0,1,2,2],[0,3,0,29],[1,3,1,29],[2,3,2,29]]}
[null,{"$error":"#VALUE!"},null,"HMA & SMA Mix Design Report"]
[null,null,null,"Wisconsin Department of Transportation"]
[null,null,null,{"$f":"\"DT2490        \" & TEXT(INTERNAL_SYS_VAR!$B$4,\"M/YYYY\")","v":"DT2490        3/2026"}]

{"sheet":"Mix Design Data Entry","index":1,"n_rows":82,"n_cols":16,"rows_kept":82,"cut":false,"hidden":false,"merged":[[71,5,71,6],[73,2,75,15],[48,1,48,2],[49,1,49,2],[50,1,50,2],[48,3,48,4],[49,3,49,4],[50,3,50,4],[53,3,53,4],[54,3,54,4],[55,3,55,4],[53,5,53,6],[54,5,54,6],[55,5,55,6],[53,1,53,2],[54,1,54,2],[55,1,55,2],[62,1,62,6],[67,1,67,6],[70,1,70,6],[63,5,63,6],[64,5,64,6],[65,5,65,6],[66,5,66,6],[68,5,68,6],[69,5,69,6],[13,3,13,4],[45,1,45,15],[47,1,47,6],[48,5,48,6],[49,5,49,6],[50,5,50,6],[52,1,52,6],[57,1,57,6],[61,1,61,6],[58,4,58,6],[59,4,59,6],[54,8,54,12],[54,13,54,15],[15,1,15,15],[58,8,58,9],[59,8,59,9],[60,8,60,9],[61,8,61,9],[57,8,57,9],[20,1,20,2],[58,1,58,3],[23,1,23,2],[71,1,71,4],[0,3,0,15],[43,1,43,2],[38,1,38,2],[39,1,39,2],[40,1,40,2],[41,1,41,2],[42,1,42,2],[48,10,48,12],[47,8,47,12],[48,8,49,9],[50,8,50,9],[51,8,51,9],[62,8,62,9],[56,8,56,15],[68,1,68,4],[69,1,69,4],[64,8,64,15],[63,1,63,4],[64,1,64,4],[65,1,65,4],[66,1,66,4],[47,14,47,15],[53,8,53,15],[17,14,17,15],[8,8,8,9],[9,8,9,9],[6,5,9,5],[11,14,11,15],[6,3,6,4],[7,3,7,4],[8,3,8,4],[9,3,9,4],[10,3,10,4],[11,3,11,4],[77,1,77,15],[78,1,78,15],[79,1,79,15],[80,1,80,15],[81,1,81,15],[0,1,2,2],[1,3,1,15],[2,3,2,15],[4,8,4,9],[5,8,5,9],[3,14,3,15],[4,14,4,15],[5,14,5,15],[10,14,10,15],[6,8,6,9],[10,5,13,5],[7,14,7,15],[4,3,4,4],[5,3,5,4],[12,3,12,4],[7,8,7,9],[22,1,22,2],[59,1,59,3],[25,14,36,14]]}
[null,{"$error":"#VALUE!"},null,"HMA & SMA Mix Design Report"]
[null,null,null,"Wisconsin Department of Transportation"]
[null,null,null,{"$f":"\"DT2490        \" & TEXT(INTERNAL_SYS_VAR!$B$4,\"M/YYYY\")","v":"DT2490        3/2026"}]
[]
[null,null,"WisDOT Project ID:",null,null,null,null,"Design Lab or Company:",null,null,"       ",null,null,"WisDOT Mix Design ID:"]
[null,null,"Mix Design ID:",null,null,null,null,"Mix Designer:",null,null,null,null,null,"WisDOT Design Verification Date:"]
{"$rows_left_out":77}
{"sheet":"One-Point Verification","index":2,"n_rows":31,"n_cols":14,"rows_kept":31,"cut":false,"hidden":false,"merged":[[24,10,24,13],[31,1,34,13],[6,10,6,13],[7,10,7,13],[8,10,8,13],[9,10,9,13],[12,1,12,13],[22,1,22,13],[6,3,6,6],[7,3,7,6],[8,3,8,6],[9,3,9,6],[10,3,10,6],[11,1,11,13],[10,10,10,13],[20,1,20,2],[23,1,23,13],[5,1,5,13],[0,3,0,13],[4,1,4,13],[19,1,19,2],[14,1,14,2],[15,1,15,2],[16,1,16,2],[17,1,17,2],[18,1,18,2],[0,1,2,2],[1,3,1,13],[2,3,2,13]]}
[null,{"$error":"#VALUE!"},null,"HMA & SMA Mix Design Report"]
[null,null,null,"Wisconsin Department of Transportation"]
[null,null,null,{"$f":"\"DT2490        \" & TEXT(INTERNAL_SYS_VAR!$B$4,\"M/YYYY\")","v":"DT2490        3/2026"}]
[]
[null,"Mix Design One-Point Verification"]
[null,"Instructions: Fill out cells that are light blue. Dark blue cells are calculated automatically."]
{"$rows_left_out":26}
{"sheet":"3.0% Va Regression","index":3,"n_rows":49,"n_cols":8,"rows_kept":49,"cut":false,"hidden":false,"merged":[[21,3,21,4],[22,3,22,4],[34,3,34,7],[36,3,36,7],[37,3,37,7],[28,3,28,7],[9,4,9,8],[10,4,10,8],[8,4,8,8],[12,1,12,8],[20,3,20,4],[0,3,0,8],[4,1,4,8],[6,4,6,8],[7,4,7,8],[0,1,2,2],[1,3,1,8],[2,3,2,8],[46,3,46,7],[47,3,47,7],[48,3,48,7],[26,1,26,8],[30,1,30,8],[32,3,32,7],[33,3,33,7],[39,1,39,8],[41,3,41,7],[42,3,42,7],[43,3,43,7],[44,3,44,7],[45,3,45,7],[35,3,35,7]]}
[null,{"$error":"#VALUE!"},null,"HMA & SMA Mix Design Report"]
[null,null,null,"Wisconsin Department of Transportation"]
[null,null,null,{"$f":"\"DT2490        \" & TEXT(INTERNAL_SYS_VAR!$B$4,\"M/YYYY\")","v":"DT2490        3/2026"}]
[]
[null,"3.0% Air Void Regression Calculator"]
[]
{"$rows_left_out":44}
{"sheet":"Convert to .txt File","index":4,"n_rows":23,"n_cols":46,"rows_kept":23,"cut":false,"hidden":true,"merged":[]}
["SampleCard",{"$f":"IF('Mix Design Data Entry'!$D$5=\"\",\"\",'Mix Design Data Entry'!$D$5)","v":""},"DR",{"$f":"IF('Mix Design Data Entry'!$I$10=\"\",\"\",'Mix Design Data Entry'!$I$10)","v":""},{"$f":"IF('Mix Design Data Entry'!$I$6=\"\",\"\",'Mix Design Data Entry'!$I$6)","v":""},{"$f":"IF('Mix Design Data Entry'!$I$7=\"\",\"\",'Mix Design Data Entry'!$I$7)","v":""},"Y",{"$f":"_xlfn.CONCAT($D$2,\" \",$C$2)","v":" "},{"$f":"IF('Mix Design Data Entry'!$I$8=\"\",\"\",'Mix Design Data Entry'!$I$8)","v":""},{"$f":"IF('Mix Design Data Entry'!$I$9=\"\",\"\",'Mix Design Data Entry'!$I$9)","v":""},{"$f":"IF('Mix Design Data Entry'!$C$74=\"\",\"\",'Mix Design Data Entry'!$C$74)","v":""}]
["MixDesign",{"$f":"IF('Mix Design Data Entry'!$D$6=\"\",\"\",'Mix Design Data Entry'!$D$6)","v":""},{"$f":"IF('Mix Design Data Entry'!$D$7=\"\",\"\",'Mix Design Data Entry'!$D$7)","v":""},{"$f":"IF('Mix Design Data Entry'!$D$8=\"\",\"\",'Mix Design Data Entry'!$D$8)","v":""},{"$f":"IF('Mix Design Data Entry'!$J$71=\"\",\"\",'Mix Design Data Entry'!$J$71)","v":""},{"$f":"IF('Mix Design Data Entry'!$K$71=\"\",\"\",'Mix Design Data Entry'!$K$71)","v":""},{"$f":"IF('Mix Design Data Entry'!$D$11=\"\",\"\",'Mix Design Data Entry'!$D$11)","v":""},{"$f":"IF('Mix Design Data Entry'!$D$12=\"\",\"\",'Mix Design Data Entry'!$D$12)","v":""},{"$f":"IF('Mix Design Data Entry'!$D$13=\"\",\"\",'Mix Design Data Entry'!$D$13)","v":""},{"$f":"IF('Mix Design Data Entry'!$D$14=\"\",\"\",'Mix Design Data Entry'!$D$14)","v":""},{"$f":"IF('Mix Design Data Entry'!$L$24=\"\",\"\",'Mix Design Data Entry'!$L$24)","v":""},{"$f":"IF('Mix Design Data Entry'!$M$24=\"\",\"\",'Mix Design Data Entry'!$M$24)","v":""},{"$f":"IF('Mix Design Data Entry'!$N$24=\"\",\"\",'Mix Design Data Entry'!$N$24)","v":""},{"$f":"IF('Mix Design Data Entry'!$F$55=\"\",\"\",'Mix Design Data Entry'!$F$55)","v":""},{"$f":"IF('Mix Design Data Entry'!$F$56=\"\",\"\",'Mix Design Data Entry'!$F$56)","v":""},{"$f":"IF('Mix Design Data Entry'!$L$71=\"\",\"\",'Mix Design Data Entry'!$L$71)","v":""},{"$f":"IF('Mix Design Data Entry'!$M$71=\"\",\"\",'Mix Design Data Entry'!$M$71)","v":""},{"$f":"IF('Mix Design Data Entry'!$P$42=\"\",\"\",'Mix Design Data Entry'!$P$42)","v":""},{"$f":"IF('Mix Design Data Entry'!$P$22=\"\",\"\",'Mix Design Data Entry'!$P$22)","v":""},{"$f":"IF('Mix Design Data Entry'!$N$55=\"\",\"\",'Mix Design Data Entry'!$N$55)","v":""},{"$f":"IF('Mix Design Data Entry'!$P$40=\"\",\"\",'Mix Design Data Entry'!$P$40)","v":""},{"$f":"IF('Mix Design Data Entry'!$P$41=\"\",\"\",'Mix Design Data Entry'!$P$41)","v":""},{"$f":"IF('Mix Design Data Entry'!$P$44=\"\",\"\",'Mix Design Data Entry'!$P$44)","v":""},{"$f":"IF('Mix Design Data Entry'!$F$64=\"\",\"\",'Mix Design Data Entry'!$F$64)","v":""},{"$f":"IF('Mix Design Data Entry'!$F$67=\"\",\"\",'Mix Design Data Entry'!$F$67)","v":""},{"$f":"IF('Mix Design Data Entry'!$P$43=\"\",\"\",'Mix Design Data Entry'!$P$43)","v":""},{"$f":"IF('Mix Design Data Entry'!$P$52=\"\",\"\",'Mix Design Data Entry'!$P$52)","v":""},{"$f":"IF('Mix Design Data Entry'!$D$50=\"\",\"\",'Mix Design Data Entry'!$D$50)","v":""},{"$f":"IF('Mix Design Data Entry'!$F$50=\"\",\"\",'Mix Design Data Entry'!$F$50)","v":""},{"$f":"IF('Mix Design Data Entry'!$D$51=\"\",\"\",'Mix Design Data Entry'!$D$51)","v":""},{"$f":"IF('Mix Design Data Entry'!$F$51=\"\",\"\",'Mix Design Data Entry'!$F$51)","v":""},{"$f":"IF('Mix Design Data Entry'!$M$51=\"\",\"\",'Mix Design Data Entry'!$M$51)","v":""},{"$f":"IF('Mix Design Data Entry'!$P$49=\"\",\"\",'Mix Design Data Entry'!$P$49)","v":""},{"$f":"IF('Mix Design Data Entry'!$P$50=\"\",\"\",'Mix Design Data Entry'!$P$50)","v":""},{"$f":"IF('Mix Design Data Entry'!$P$51=\"\",\"\",'Mix Design Data Entry'!$P$51)","v":""},{"$f":"IF('Mix Design Data Entry'!$B$60=\"\",\"\",'Mix Design Data Entry'!$B$60)","v":""},{"$f":"IF('Mix Design Data Entry'!$E$60=\"\",\"\",'Mix Design Data Entry'!$E$60)","v":""},{"$f":"IF('Mix Design Data Entry'!$F$65=\"\",\"\",'Mix Design Data Entry'!$F$65)","v":""},{"$f":"IF('Mix Design Data Entry'!$F$66=\"\",\"\",'Mix Design Data Entry'!$F$66)","v":""},{"$f":"IF('Mix Design Data Entry'!$P$23=\"\",\"\",'Mix Design Data Entry'!$P$23)","v":""},{"$f":"IF('Mix Design Data Entry'!$P$24=\"\",\"\",'Mix Design Data Entry'!$P$24)","v":""},{"$f":"IF('Mix Design Data Entry'!$F$69=\"\",\"\",'Mix Design Data Entry'!$F$69)","v":""},{"$f":"IF('Mix Design Data Entry'!$F$70=\"\",\"\",'Mix Design Data Entry'!$F$70)","v":""},{"$f":"IF('Mix Design Data Entry'!$F$72=\"\",\"\",'Mix Design Data Entry'!$F$72)","v":""},{"$f":"IF('Mix Design Data Entry'!$D$9=\"\",\"\",'Mix Design Data Entry'!$D$9)","v":""},{"$f":"IF('Mix Design Data Entry'!$D$10=\"\",\"\",'Mix Design Data Entry'!$D$10)","v":""}]
[{"$f":"IF($B$3=\"\",\"\",\"AggtSample\")","v":""},{"$f":"IF('Mix Design Data Entry'!$D$20=\"\",\"\",'Mix Design Data Entry'!$D$20)","v":""},{"$f":"IF('Mix Design Data Entry'!$D$23=\"\",\"\",'Mix Design Data Entry'!$D$23)","v":""},{"$f":"IF('Mix Design Data Entry'!$D$22=\"\",\"\",'Mix Design Data Entry'!$D$22)","v":""},{"$f":"IF('Mix Design Data Entry'!$D$27=\"\",\"\",'Mix Design Data Entry'!$D$27)","v":""},{"$f":"IF('Mix Design Data Entry'!$D$28=\"\",\"\",'Mix Design Data Entry'!$D$28)","v":""},{"$f":"IF('Mix Design Data Entry'!$D$29=\"\",\"\",'Mix Design Data Entry'!$D$29)","v":""},{"$f":"IF('Mix Design Data Entry'!$D$30=\"\",\"\",'Mix Design Data Entry'!$D$30)","v":""},{"$f":"IF('Mix Design Data Entry'!$D$31=\"\",\"\",'Mix Design Data Entry'!$D$31)","v":""},{"$f":"IF('Mix Design Data Entry'!$D$32=\"\",\"\",'Mix Design Data Entry'!$D$32)","v":""},{"$f":"IF('Mix Design Data Entry'!$D$33=\"\",\"\",'Mix Design Data Entry'!$D$33)","v":""},{"$f":"IF('Mix Design Data Entry'!$D$34=\"\",\"\",'Mix Design Data Entry'!$D$34)","v":""},{"$f":"IF('Mix Design Data Entry'!$D$35=\"\",\"\",'Mix Design Data Entry'!$D$35)","v":""},{"$f":"IF('Mix Design Data Entry'!$D$36=\"\",\"\",'Mix Design Data Entry'!$D$36)","v":""},{"$f":"IF('Mix Design Data Entry'!$D$37=\"\",\"\",'Mix Design Data Entry'!$D$37)","v":""},{"$f":"IF('Mix Design Data Entry'!$D$19=\"\",\"\",'Mix Design Data Entry'!$D$19)","v":""},{"$f":"IF('Mix Design Data Entry'!$D$39=\"\",\"\",'Mix Design Data Entry'!$D$39)","v":""},null,{"$f":"IF('Mix Design Data Entry'!$D$21=\"\",\"\",'Mix Design Data Entry'!$D$21)","v":""},null,"  "]
[{"$f":"IF($B$4=\"\",\"\",\"AggtSample\")","v":""},{"$f":"IF('Mix Design Data Entry'!$E$20=\"\",\"\",'Mix Design Data Entry'!$E$20)","v":""},{"$f":"IF('Mix Design Data Entry'!$E$23=\"\",\"\",'Mix Design Data Entry'!$E$23)","v":""},{"$f":"IF('Mix Design Data Entry'!$E$22=\"\",\"\",'Mix Design Data Entry'!$E$22)","v":""},{"$f":"IF('Mix Design Data Entry'!$E$27=\"\",\"\",'Mix Design Data Entry'!$E$27)","v":""},{"$f":"IF('Mix Design Data Entry'!$E$28=\"\",\"\",'Mix Design Data Entry'!$E$28)","v":""},{"$f":"IF('Mix Design Data Entry'!$E$29=\"\",\"\",'Mix Design Data Entry'!$E$29)","v":""},{"$f":"IF('Mix Design Data Entry'!$E$30=\"\",\"\",'Mix Design Data Entry'!$E$30)","v":""},{"$f":"IF('Mix Design Data Entry'!$E$31=\"\",\"\",'Mix Design Data Entry'!$E$31)","v":""},{"$f":"IF('Mix Design Data Entry'!$E$32=\"\",\"\",'Mix Design Data Entry'!$E$32)","v":""},{"$f":"IF('Mix Design Data Entry'!$E$33=\"\",\"\",'Mix Design Data Entry'!$E$33)","v":""},{"$f":"IF('Mix Design Data Entry'!$E$34=\"\",\"\",'Mix Design Data Entry'!$E$34)","v":""},{"$f":"IF('Mix Design Data Entry'!$E$35=\"\",\"\",'Mix Design Data Entry'!$E$35)","v":""},{"$f":"IF('Mix Design Data Entry'!$E$36=\"\",\"\",'Mix Design Data Entry'!$E$36)","v":""},{"$f":"IF('Mix Design Data Entry'!$E$37=\"\",\"\",'Mix Design Data Entry'!$E$37)","v":""},{"$f":"IF('Mix Design Data Entry'!$E$19=\"\",\"\",'Mix Design Data Entry'!$E$19)","v":""},{"$f":"IF('Mix Design Data Entry'!$E$39=\"\",\"\",'Mix Design Data Entry'!$E$39)","v":""},null,{"$f":"IF('Mix Design Data Entry'!$E$21=\"\",\"\",'Mix Design Data Entry'!$E$21)","v":""},"  "]
[{"$f":"IF($B$5=\"\",\"\",\"AggtSample\")","v":""},{"$f":"IF('Mix Design Data Entry'!$F$20=\"\",\"\",'Mix Design Data Entry'!$F$20)","v":""},{"$f":"IF('Mix Design Data Entry'!$F$23=\"\",\"\",'Mix Design Data Entry'!$F$23)","v":""},{"$f":"IF('Mix Design Data Entry'!$F$22=\"\",\"\",'Mix Design Data Entry'!$F$22)","v":""},{"$f":"IF('Mix Design Data Entry'!$F$27=\"\",\"\",'Mix Design Data Entry'!$F$27)","v":""},{"$f":"IF('Mix Design Data Entry'!$F$28=\"\",\"\",'Mix Design Data Entry'!$F$28)","v":""},{"$f":"IF('Mix Design Data Entry'!$F$29=\"\",\"\",'Mix Design Data Entry'!$F$29)","v":""},{"$f":"IF('Mix Design Data Entry'!$F$30=\"\",\"\",'Mix Design Data Entry'!$F$30)","v":""},{"$f":"IF('Mix Design Data Entry'!$F$31=\"\",\"\",'Mix Design Data Entry'!$F$31)","v":""},{"$f":"IF('Mix Design Data Entry'!$F$32=\"\",\"\",'Mix Design Data Entry'!$F$32)","v":""},{"$f":"IF('Mix Design Data Entry'!$F$33=\"\",\"\",'Mix Design Data Entry'!$F$33)","v":""},{"$f":"IF('Mix Design Data Entry'!$F$34=\"\",\"\",'Mix Design Data Entry'!$F$34)","v":""},{"$f":"IF('Mix Design Data Entry'!$F$35=\"\",\"\",'Mix Design Data Entry'!$F$35)","v":""},{"$f":"IF('Mix Design Data Entry'!$F$36=\"\",\"\",'Mix Design Data Entry'!$F$36)","v":""},{"$f":"IF('Mix Design Data Entry'!$F$37=\"\",\"\",'Mix Design Data Entry'!$F$37)","v":""},{"$f":"IF('Mix Design Data Entry'!$F$19=\"\",\"\",'Mix Design Data Entry'!$F$19)","v":""},{"$f":"IF('Mix Design Data Entry'!$F$39=\"\",\"\",'Mix Design Data Entry'!$F$39)","v":""},null,{"$f":"IF('Mix Design Data Entry'!$F$21=\"\",\"\",'Mix Design Data Entry'!$F$21)","v":""},"  "]
[{"$f":"IF($B$6=\"\",\"\",\"AggtSample\")","v":""},{"$f":"IF('Mix Design Data Entry'!$G$20=\"\",\"\",'Mix Design Data Entry'!$G$20)","v":""},{"$f":"IF('Mix Design Data Entry'!$G$23=\"\",\"\",'Mix Design Data Entry'!$G$23)","v":""},{"$f":"IF('Mix Design Data Entry'!$G$22=\"\",\"\",'Mix Design Data Entry'!$G$22)","v":""},{"$f":"IF('Mix Design Data Entry'!$G$27=\"\",\"\",'Mix Design Data Entry'!$G$27)","v":""},{"$f":"IF('Mix Design Data Entry'!$G$28=\"\",\"\",'Mix Design Data Entry'!$G$28)","v":""},{"$f":"IF('Mix Design Data Entry'!$G$29=\"\",\"\",'Mix Design Data Entry'!$G$29)","v":""},{"$f":"IF('Mix Design Data Entry'!$G$30=\"\",\"\",'Mix Design Data Entry'!$G$30)","v":""},{"$f":"IF('Mix Design Data Entry'!$G$31=\"\",\"\",'Mix Design Data Entry'!$G$31)","v":""},{"$f":"IF('Mix Design Data Entry'!$G$32=\"\",\"\",'Mix Design Data Entry'!$G$32)","v":""},{"$f":"IF('Mix Design Data Entry'!$G$33=\"\",\"\",'Mix Design Data Entry'!$G$33)","v":""},{"$f":"IF('Mix Design Data Entry'!$G$34=\"\",\"\",'Mix Design Data Entry'!$G$34)","v":""},{"$f":"IF('Mix Design Data Entry'!$G$35=\"\",\"\",'Mix Design Data Entry'!$G$35)","v":""},{"$f":"IF('Mix Design Data Entry'!$G$36=\"\",\"\",'Mix Design Data Entry'!$G$36)","v":""},{"$f":"IF('Mix Design Data Entry'!$G$37=\"\",\"\",'Mix Design Data Entry'!$G$37)","v":""},{"$f":"IF('Mix Design Data Entry'!$G$19=\"\",\"\",'Mix Design Data Entry'!$G$19)","v":""},{"$f":"IF('Mix Design Data Entry'!$G$39=\"\",\"\",'Mix Design Data Entry'!$G$39)","v":""},null,{"$f":"IF('Mix Design Data Entry'!$G$21=\"\",\"\",'Mix Design Data Entry'!$G$21)","v":""}]
{"$rows_left_out":18}
{"sheet":"Text Template","index":5,"n_rows":23,"n_cols":46,"rows_kept":23,"cut":false,"hidden":true,"merged":[]}
["SampleCard","Project ID","Testing Report Type","Mix Design Date","Certified Mix Designer Name","Certified Mix Designer ID","Satisfactory_YN","ML_Material (Mix Type and Mix NMAS)","MFG Name","Plant No / Location","Comments"]
["MixDesign","Design ID","Mix Type","Mix Nmas","Pct AC Total","Pct AC Added","Virgin AC PG","Virgin Binder Designation","AC SP Gravity","AC Source","RAM 1 (RAP) % AC","RAM 2 (RAS) % AC","RAM 3 (FRAP) % AC","Pct Gmm @ Nini","Pct Gmm @ Nmax","Gmm @ 4% Va","Gmb @ 4% Va","Blend FAA","Sand Equiv Pct","Gmm Dryback CF","Blend CAA 1F","Blend CAA 2F","Blend Thin Elong","TSR - Gyrations","TSR","Moisture Absorption","Dust Proportion","HMA/SMA Mix Temp","HMA/SMA Compaction Temp","WMA Mix Temp","WMA Compaction Temp","SMA Draindown Avg @ Plant Temp","PBR","Pbe","Pba","Additive Amount","Additive Amount Amount","TSR - Wet Strength","TSR - Dry Strength","Clay Lumps","Plasticity Index","Hamburg Final Rut Depth","Hamburg Passes to Test Completion","IDEAL-CT CT-Index","Mix PG","Mix Binder Designation"]
["AggtSample","Material 1 Description","Material 1 Agg Source ID","Material 1 P / Q / MF / Dust","Material 1 Sieve_Wt_25","Material 1 Sieve_Wt_19","Material 1 Sieve_Wt_125","Material 1 Sieve_Wt_95","Material 1 Sieve_Wt_475","Material 1 Sieve_Wt_236","Material 1 Sieve_Wt_118","Material 1 Sieve_Wt_060","Material 1 Sieve_Wt_030","Material 1 Sieve_Wt_0150","Material 1 Sieve_Wt_0075","Material 1 Blend_Pct","Material 1 Gsb","<BLANK>","Material 1 Source Name",null,"  "]
["AggtSample","Material 2 Description","Material 2 Agg Source ID","Material 2 P / Q / MF / Dust","Material 2 Sieve_Wt_25","Material 2 Sieve_Wt_19","Material 2 Sieve_Wt_125","Material 2 Sieve_Wt_95","Material 2 Sieve_Wt_475","Material 2 Sieve_Wt_236","Material 2 Sieve_Wt_118","Material 2 Sieve_Wt_060","Material 2 Sieve_Wt_030","Material 2 Sieve_Wt_0150","Material 2 Sieve_Wt_0075","Material 2 Blend_Pct","Material 2 Gsb","<BLANK>","Material 2 Source Name","  "]
["AggtSample","Material 3 Description","Material 3 Agg Source ID","Material 3 P / Q / MF / Dust","Material 3 Sieve_Wt_25","Material 3 Sieve_Wt_19","Material 3 Sieve_Wt_125","Material 3 Sieve_Wt_95","Material 3 Sieve_Wt_475","Material 3 Sieve_Wt_236","Material 3 Sieve_Wt_118","Material 3 Sieve_Wt_060","Material 3 Sieve_Wt_030","Material 3 Sieve_Wt_0150","Material 3 Sieve_Wt_0075","Material 3 Blend_Pct","Material 3 Gsb","<BLANK>","Material 3 Source Name","  "]
["AggtSample","Material 4 Description","Material 4 Agg Source ID","Material 4 P / Q / MF / Dust","Material 4 Sieve_Wt_25","Material 4 Sieve_Wt_19","Material 4 Sieve_Wt_125","Material 4 Sieve_Wt_95","Material 4 Sieve_Wt_475","Material 4 Sieve_Wt_236","Material 4 Sieve_Wt_118","Material 4 Sieve_Wt_060","Material 4 Sieve_Wt_030","Material 4 Sieve_Wt_0150","Material 4 Sieve_Wt_0075","Material 4 Blend_Pct","Material 4 Gsb","<BLANK>","Material 4 Source Name"]
{"$rows_left_out":18}
{"sheet":"Agg_Properties","index":6,"n_rows":29,"n_cols":15,"rows_kept":29,"cut":false,"hidden":true,"merged":[[27,14,28,14],[27,1,28,1],[28,3,28,13],[14,1,21,1],[22,1,25,1]]}
[]
[null,null,null,{"$f":"'Mix Design Data Entry'!D18","v":"Agg 1"},{"$f":"'Mix Design Data Entry'!E18","v":"Agg 2"},{"$f":"'Mix Design Data Entry'!F18","v":"Agg 3"},{"$f":"'Mix Design Data Entry'!G18","v":"Agg 4"},{"$f":"'Mix Design Data Entry'!H18","v":"Agg 5"},{"$f":"'Mix Design Data Entry'!I18","v":"Agg 6"},{"$f":"'Mix Design Data Entry'!J18","v":"Agg 7"},{"$f":"'Mix Design Data Entry'!K18","v":"Agg 8"},{"$f":"'Mix Design Data Entry'!L18","v":"RAM 1\n(RAP)"},{"$f":"'Mix Design Data Entry'!M18","v":"RAM 2\n(RAS)"},{"$f":"'Mix Design Data Entry'!N18","v":"RAM 3\n(FRAP)"}]
[null,null,"Material Description:",{"$f":"IF('Mix Design Data Entry'!D20=\"\",\"\",'Mix Design Data Entry'!D20)","v":""},{"$f":"IF('Mix Design Data Entry'!E20=\"\",\"\",'Mix Design Data Entry'!E20)","v":""},{"$f":"IF('Mix Design Data Entry'!F20=\"\",\"\",'Mix Design Data Entry'!F20)","v":""},{"$f":"IF('Mix Design Data Entry'!G20=\"\",\"\",'Mix Design Data Entry'!G20)","v":""},{"$f":"IF('Mix Design Data Entry'!H20=\"\",\"\",'Mix Design Data Entry'!H20)","v":""},{"$f":"IF('Mix Design Data Entry'!I20=\"\",\"\",'Mix Design Data Entry'!I20)","v":""},{"$f":"IF('Mix Design Data Entry'!J20=\"\",\"\",'Mix Design Data Entry'!J20)","v":""},{"$f":"IF('Mix Design Data Entry'!K20=\"\",\"\",'Mix Design Data Entry'!K20)","v":""},{"$f":"IF('Mix Design Data Entry'!L20=\"\",\"\",'Mix Design Data Entry'!L20)","v":""},{"$f":"IF('Mix Design Data Entry'!M20=\"\",\"\",'Mix Design Data Entry'!M20)","v":""},{"$f":"IF('Mix Design Data Entry'!N20=\"\",\"\",'Mix Design Data Entry'!N20)","v":""}]
[null,null,"WisDOT Agg Source ID:\n(225-xxxx-xxxx)",{"$f":"IF('Mix Design Data Entry'!D23=\"\",\"\",'Mix Design Data Entry'!D23)","v":""},{"$f":"IF('Mix Design Data Entry'!E23=\"\",\"\",'Mix Design Data Entry'!E23)","v":""},{"$f":"IF('Mix Design Data Entry'!F23=\"\",\"\",'Mix Design Data Entry'!F23)","v":""},{"$f":"IF('Mix Design Data Entry'!G23=\"\",\"\",'Mix Design Data Entry'!G23)","v":""},{"$f":"IF('Mix Design Data Entry'!H23=\"\",\"\",'Mix Design Data Entry'!H23)","v":""},{"$f":"IF('Mix Design Data Entry'!I23=\"\",\"\",'Mix Design Data Entry'!I23)","v":""},{"$f":"IF('Mix Design Data Entry'!J23=\"\",\"\",'Mix Design Data Entry'!J23)","v":""},{"$f":"IF('Mix Design Data Entry'!K23=\"\",\"\",'Mix Design Data Entry'!K23)","v":""},{"$f":"IF('Mix Design Data Entry'!L23=\"\",\"\",'Mix Design Data Entry'!L23)","v":""},{"$f":"IF('Mix Design Data Entry'!M23=\"\",\"\",'Mix Design Data Entry'!M23)","v":""},{"$f":"IF('Mix Design Data Entry'!N23=\"\",\"\",'Mix Design Data Entry'!N23)","v":""}]
[null,null,"Blend Percentages (0.1%):",{"$f":"IF('Mix Design Data Entry'!D19=\"\",0,'Mix Design Data Entry'!D19)","v":0},{"$f":"IF('Mix Design Data Entry'!E19=\"\",0,'Mix Design Data Entry'!E19)","v":0},{"$f":"IF('Mix Design Data Entry'!F19=\"\",0,'Mix Design Data Entry'!F19)","v":0},{"$f":"IF('Mix Design Data Entry'!G19=\"\",0,'Mix Design Data Entry'!G19)","v":0},{"$f":"IF('Mix Design Data Entry'!H19=\"\",0,'Mix Design Data Entry'!H19)","v":0},{"$f":"IF('Mix Design Data Entry'!I19=\"\",0,'Mix Design Data Entry'!I19)","v":0},{"$f":"IF('Mix Design Data Entry'!J19=\"\",0,'Mix Design Data Entry'!J19)","v":0},{"$f":"IF('Mix Design Data Entry'!K19=\"\",0,'Mix Design Data Entry'!K19)","v":0},{"$f":"IF('Mix Design Data Entry'!L19=\"\",0,'Mix Design Data Entry'!L19)","v":0},{"$f":"IF('Mix Design Data Entry'!M19=\"\",0,'Mix Design Data Entry'!M19)","v":0},{"$f":"IF('Mix Design Data Entry'!N19=\"\",0,'Mix Design Data Entry'!N19)","v":0}]
[null,null,"Percent Passing #4 (4.75-mm):",{"$f":"IF('Mix Design Data Entry'!D31=\"\",0,'Mix Design Data Entry'!D31)","v":0},{"$f":"IF('Mix Design Data Entry'!E31=\"\",0,'Mix Design Data Entry'!E31)","v":0},{"$f":"IF('Mix Design Data Entry'!F31=\"\",0,'Mix Design Data Entry'!F31)","v":0},{"$f":"IF('Mix Design Data Entry'!G31=\"\",0,'Mix Design Data Entry'!G31)","v":0},{"$f":"IF('Mix Design Data Entry'!H31=\"\",0,'Mix Design Data Entry'!H31)","v":0},{"$f":"IF('Mix Design Data Entry'!I31=\"\",0,'Mix Design Data Entry'!I31)","v":0},{"$f":"IF('Mix Design Data Entry'!J31=\"\",0,'Mix Design Data Entry'!J31)","v":0},{"$f":"IF('Mix Design Data Entry'!K31=\"\",0,'Mix Design Data Entry'!K31)","v":0},{"$f":"IF('Mix Design Data Entry'!L31=\"\",0,'Mix Design Data Entry'!L31)","v":0},{"$f":"IF('Mix Design Data Entry'!M31=\"\",0,'Mix Design Data Entry'!M31)","v":0},{"$f":"IF('Mix Design Data Entry'!N31=\"\",0,'Mix Design Data Entry'!N31)","v":0}]
{"$rows_left_out":24}
{"sheet":"INTERNAL_SYS_VAR","index":7,"n_rows":11,"n_cols":23,"rows_kept":11,"cut":false,"hidden":true,"merged":[[1,10,1,16]]}
[]
[null,"Worksheet Version","NMAS","MixType","Allowed Virgin PG Grades","Binder Designation","Allowed Resultant PG Grades","Aggregate Type","RAM Type","Additive Types","Gyratory Compaction",null,null,null,null,null,null,"Trial Binder Data Trial Dropdown","DYNAMIC NMAS LIST","JMF OPTIMUM AC TITLE BLOCK MESSAGES","GYRATORY COMPACTION EFFORT TITLE BLOCK MESSAGES","PERFORMANCE TITLE BLOCK MESSAGES","One Point Verification Type"]
[null,"2.0.1","1 - 37.5 mm","LT","52-22","S","58-28","P","RAP","Warm Mix Additive","Level","LT","MT","HT","SMA","Polymer-Modified HMA Overlay","Interlayer","OPT. @ 4.0% Va",{"$f":"_xlfn.SWITCH('Mix Design Data Entry'!$D$7,0,\"ENTER A MIX TYPE\",$L$3,$C$3:$C$8,$M$3,$C$3:$C$8,$N$3,$C$3:$C$8,$O$3,$C$6:$C$7,$P$3,$C$9,$Q$3,$C$10)","v":"ENTER A MIX TYPE"},"JMF PROPERTIES AT OPTIMUM % ASPHALT CONTENT AT 4.0% AIR VOIDS FOR HMA / 4.5% AIR VOIDS FOR SMA / 2.0% AIR VOIDS FOR INTERLAYER / 1.0% AIR VOIDS FOR POLYMER-MODIFIED HMA OVERLAY","Gyratory Compaction Effort (% Gmm at Optimum AC at Design Va)","Performance (at Optimum AC at Production Va)",1]
[null,"2026-03-02","2 - 25.0 mm","MT","52-28","H","58-34","Q","FRAP","Liquid Anti-Strip","Nini",6,7,8,7,6,"N/A","OPT. @ 4.5% Va",null,"JMF PROPERTIES AT OPTIMUM % ASPHALT CONTENT AT 4.0% AIR VOIDS FOR HMA","Gyratory Compaction Effort (% Gmm at Optimum AC at 4.0% Va)","Performance (at Optimum AC at 3.0% Va)"]
[null,null,"3 - 19.0 mm","HT","52-34","V","64-28","MF","RAS","Cellulose Fibers","Ndes",40,75,100,65,50,50,"OPT. @ 2.0% Va",null,"JMF PROPERTIES AT OPTIMUM % ASPHALT CONTENT AT 4.5% AIR VOIDS FOR SMA","Gyratory Compaction Effort (% Gmm at Optimum AC at 4.5% Va)","Performance (at Optimum AC at 4.5% Va)"]
[null,null,"4 - 12.5 mm","SMA","58-22","E","64-34","Dust",null,"Hydrated Lime Anti-Strip","Nmax",60,115,160,100,75,"N/A","OPT. @ 1.0% Va",null,"JMF PROPERTIES AT OPTIMUM % ASPHALT CONTENT AT 2.0% AIR VOIDS FOR INTERLAYER","Gyratory Compaction Effort (% Gmm at Optimum AC at 2.0% Va)","Performance (at Optimum AC at 2.0% Va)"]
{"$rows_left_out":5}